{"text_format":"1","workbook":"xlsx","n_sheets":25,"sheets":["このアプリについて","ナビゲーションメニュー","ユーザー登録フォーム","店舗設定","顧客一覧","顧客登録","商品一覧","商品登録","商品一括登録","商品分析","受注一覧","受注登録","出荷登録","請求登録","入金登録","請求書","システムマスタ","帳票設定","ルールシート","ゆうパック宛名エクスポート","ヤマトB2エクスポート","発注一覧","発注登録","検品登録","支払登録"],"not_rendered":{"charts":0,"images":32,"macros":1,"external_links":2,"defined_names":36,"comments":7,"pivot_tables":0},"unopened":[],"bounds":{"document_bytes":16777216,"sheet_cells":100000,"rows_first":2000,"rows_last":500,"rows_between":2000,"halvings":0,"cell_chars":16384,"cell_head_chars":4096},"cells_cut":0,"cells_raw":0,"read":"whole","date_system":"1900"}

{"sheet":"このアプリについて","index":0,"n_rows":81,"n_cols":8,"rows_kept":81,"cut":false,"hidden":false,"merged":[[73,25,73,26],[73,28,73,29],[3,25,3,26],[3,28,3,29],[3,31,3,32],[52,25,52,26],[52,28,52,29],[1,25,1,26],[1,28,1,29],[1,31,1,32],[60,25,60,26],[60,28,60,29]]}
[]
[null,null,"　　　このアプリについて"]
[]
[null,null,"特徴"]
[]
[null,"本アプリは楽天、Yahoo、Amazonなどの複数のネットショップを一括して管理、運営する事のできるEXCEL版クラウド型ネットショップ一元管理システムです。"]
[null,"バラバラになっている様々な業務を一元化・自動化し、毎日の「手間」を削減します。"]
[]
[null,"それぞれの店舗管理画面で行っていた受注処理や出荷業務、在庫管理を本アプリ内で完結します。加えて、単純作業の自動化によって"]
[null,"人数を増やさずにネットショップの多店舗展開、運営をお手伝いします。"]
{"$rows_left_out":72}
{"sheet":"ナビゲーションメニュー","index":1,"n_rows":0,"n_cols":0,"rows_kept":0,"cut":false,"hidden":false,"merged":[]}

{"sheet":"ユーザー登録フォーム","index":2,"n_rows":33,"n_cols":5,"rows_kept":33,"cut":false,"hidden":true,"merged":[]}
["ユーザー登録フォーム"]
[]
["企業情報"]
[]
[null,"企業名","必須",null,"プロバランス株式会社"]
[null,null,null,null,"例: 有限会社ポートフォリオ"]
[null,null,null,null,"個人事業主の場合は屋号を入力してください"]
[]
[null,"企業名かな","必須",null,"ﾌﾟﾛﾊﾞﾗﾝｽ"]
[null,null,null,null,"個人事業主の場合は屋号を入力してください"]
{"$rows_left_out":24}
{"sheet":"店舗設定","index":3,"n_rows":17,"n_cols":7,"rows_kept":17,"cut":false,"hidden":true,"merged":[]}
[]
[null,null,"　　店舗設定"]
[]
[]
[]
[]
[]
[null,null,"店舗区分","店舗名","住所","ユーザID","パスワード"]
[null,null,"ネット","メルカリ","-"]
[null,null,"ネット","Amazon","-"]
{"$rows_left_out":8}
{"sheet":"顧客一覧","index":4,"n_rows":17,"n_cols":7,"rows_kept":17,"cut":false,"hidden":true,"merged":[]}
[]
[null,null,"　　　顧客一覧"]
[]
[null,null,"顧客名"]
[null,null,"担当者"]
[null,null,"タグ"]
[null,null,"顧客区分"]
[]
[]
[]
{"$rows_left_out":8}
{"sheet":"顧客登録","index":5,"n_rows":41,"n_cols":5,"rows_kept":41,"cut":false,"hidden":true,"merged":[[1,25,1,26],[1,28,1,29],[1,31,1,32]]}
[]
[null,null,"　　　顧客登録"]
[]
[]
[]
[]
[]
[]
[null,"■基本情報"]
[null,null,"顧客コード",2]
{"$rows_left_out":32}
{"sheet":"商品一覧","index":6,"n_rows":15,"n_cols":11,"rows_kept":15,"cut":false,"hidden":true,"merged":[]}
[]
[null,null,"　　　商品一覧"]
[]
[null,null,"カテゴリ大"]
[null,null,"カテゴリ中"]
[null,null,"カテゴリ小"]
[null,null,"商品名"]
[null,null,"タグ"]
[]
[]
{"$rows_left_out":6}
{"sheet":"商品登録","index":7,"n_rows":73,"n_cols":14,"rows_kept":73,"cut":false,"hidden":true,"merged":[[1,24,1,25],[1,27,1,28],[1,30,1,31]]}
[]
[null,null,"　　　商品登録"]
[]
[]
[]
[]
[]
[null,"■基本情報",null,null,null,"■商品画像"]
[null,null,"商品コード","B01M3VP8NW",null,null,"PHOTO"]
[null,null,"ASIN","B01M3VP8NW"]
{"$rows_left_out":64}
{"sheet":"商品一括登録","index":8,"n_rows":2,"n_cols":13,"rows_kept":2,"cut":false,"hidden":true,"merged":[]}
[]
["日本ASIN","アメリカASIN","商品名","検索文字補助","日本価格","日本ポイント","手数料","アメリカ価格","重量[g]","高さ[cm]","長さ[cm]","幅[cm]","例外コード"]

{"sheet":"商品分析","index":9,"n_rows":12,"n_cols":40,"rows_kept":12,"cut":false,"hidden":true,"merged":[]}
[]
["No","日本ASIN","アメリカASIN","商品名","検索文字補助","日本価格\n[円]","日本\nポイント","手数料\n[円]","アメリカ\n価格\n[$]","重量\n[g]","高さ\n[cm]","長さ\n[cm]","幅\n[cm]","サイズ\n[cm^3]","1月前\n販売数","2月前\n販売数","3月前\n販売数","3ヶ月\n合計\n販売数","購入日","購入個数","購入価格\n[$]","送料\n[$]","仕入れ\nID","希望販売価格\n[円](option)","jAmaLink","usAmaLink","usAma2Link","eBayLink","予想\n購入価格","予想\n転送料","予想\n関税","予想\n国内送料\n(+代行費)","予想\n仕入れ値","予想\n入金額","予想\n利益","予想\nROI","高利\n益率","ASIN\n不一致","ASIN\nずれ","リピート\nフラグ"]
[1,{"$f":"TEXT(商品一括登録!A3,0)","v":"0"},{"$f":"TEXT(商品一括登録!B3,0)","v":"0"},{"$f":"商品一括登録!C3","v":0},{"$f":"商品一括登録!D3","v":0},{"$f":"商品一括登録!E3","v":0},{"$f":"商品一括登録!F3","v":0},{"$f":"商品一括登録!G3","v":0},{"$f":"商品一括登録!H3","v":0},{"$f":"商品一括登録!I3","v":0},{"$f":"商品一括登録!J3","v":0},{"$f":"商品一括登録!K3","v":0},{"$f":"商品一括登録!L3","v":0},{"$f":"K3*L3*M3","v":0},{"$f":"#REF!","v":{"$error":"#REF!"}},{"$f":"#REF!","v":{"$error":"#REF!"}},{"$f":"#REF!","v":{"$error":"#REF!"}},{"$f":"SUM(O3:Q3)","v":{"$error":"#REF!"}},null,null,null,null,null,null,{"$f":"HYPERLINK(\"https://www.amazon.co.jp/dp/\"&B3)","v":"https://www.amazon.co.jp/dp/0"},{"$f":"HYPERLINK(\"https://www.amazon.com/gp/offer-listing/\"&C3&\"/ref=olp_f_new?ie=UTF8&f_new=true\")","v":"https://www.amazon.com/gp/offer-listing/0/ref=olp_f_new?ie=UTF8&f_new=true"},{"$f":"HYPERLINK(\"https://www.amazon.com/s/ref=nb_sb_noss?url=search-alias%3Daps&field-keywords=\"&E3)","v":"https://www.amazon.com/s/ref=nb_sb_noss?url=search-alias%3Daps&field-keywords=0"},{"$f":"HYPERLINK(\"http://www.ebay.com/sch/i.html?_from=R40&_sacat=0&LH_ItemCondition=3&_nkw=\"&E3&\"&_sop=15\")","v":"http://www.ebay.com/sch/i.html?_from=R40&_sacat=0&LH_ItemCondition=3&_nkw=0&_sop=15"},{"$f":"IF(U3=\"\",I3*#REF!,U3*#REF!)","v":{"$error":"#REF!"}},{"$f":"J3*#REF!","v":{"$error":"#REF!"}},{"$f":"((AC3/100)*#REF!)","v":{"$error":"#REF!"}},{"$f":"(#REF!*J3)+#REF!","v":{"$error":"#REF!"}},{"$f":"SUM(AC3:AF3)","v":{"$error":"#REF!"}},{"$f":"F3-G3-H3","v":0},{"$f":"AH3-AG3","v":{"$error":"#REF!"}},{"$f":"AI3/AG3*100","v":{"$error":"#REF!"}},{"$f":"IF(AJ3>#REF!,\"o\",\"\")","v":{"$error":"#REF!"}},{"$f":"IF(B3<>C3,\"o\",\"\")","v":""},{"$f":"IF(商品一括登録!A3=#REF!,\"o\",\"x\")","v":{"$error":"#REF!"}},{"$f":"IF(IFERROR(VLOOKUP(B3,#REF!,1,FALSE),\"\")<>\"\",\"o\",\"\")","v":""}]
[{"$f":"A3+1","v":2},{"$f":"TEXT(商品一括登録!A4,0)","v":"0"},{"$f":"TEXT(商品一括登録!B4,0)","v":"0"},{"$f":"商品一括登録!C4","v":0},{"$f":"商品一括登録!D4","v":0},{"$f":"商品一括登録!E4","v":0},{"$f":"商品一括登録!F4","v":0},{"$f":"商品一括登録!G4","v":0},{"$f":"商品一括登録!H4","v":0},{"$f":"商品一括登録!I4","v":0},{"$f":"商品一括登録!J4","v":0},{"$f":"商品一括登録!K4","v":0},{"$f":"商品一括登録!L4","v":0},{"$f":"K4*L4*M4","v":0},{"$f":"#REF!","v":{"$error":"#REF!"}},{"$f":"#REF!","v":{"$error":"#REF!"}},{"$f":"#REF!","v":{"$error":"#REF!"}},{"$f":"SUM(O4:Q4)","v":{"$error":"#REF!"}},null,null,null,null,null,null,"https://www.amazon.co.jp/dp/0","https://www.amazon.com/gp/offer-listing/0/ref=olp_f_new?ie=UTF8&f_new=true","https://www.amazon.com/s/ref=nb_sb_noss?url=search-alias%3Daps&field-keywords=0","http://www.ebay.com/sch/i.html?_from=R40&_sacat=0&LH_ItemCondition=3&_nkw=0&_sop=15",{"$f":"IF(U4=\"\",I4*#REF!,U4*#REF!)","v":{"$error":"#REF!"}},{"$f":"J4*#REF!","v":{"$error":"#REF!"}},{"$f":"((AC4/100)*#REF!)","v":{"$error":"#REF!"}},{"$f":"(#REF!*J4)+#REF!","v":{"$error":"#REF!"}},{"$error":"#REF!"},{"$f":"F4-G4-H4","v":0},{"$f":"AH4-AG4","v":{"$error":"#REF!"}},{"$error":"#REF!"},{"$f":"IF(AJ4>#REF!,\"o\",\"\")","v":{"$error":"#REF!"}},"",{"$f":"IF(商品一括登録!A4=#REF!,\"o\",\"x\")","v":{"$error":"#REF!"}},{"$f":"IF(IFERROR(VLOOKUP(B4,#REF!,1,FALSE),\"\")<>\"\",\"o\",\"\")","v":""}]
[{"$f":"A4+1","v":3},{"$f":"TEXT(商品一括登録!A5,0)","v":"0"},{"$f":"TEXT(商品一括登録!B5,0)","v":"0"},{"$f":"商品一括登録!C5","v":0},{"$f":"商品一括登録!D5","v":0},{"$f":"商品一括登録!E5","v":0},{"$f":"商品一括登録!F5","v":0},{"$f":"商品一括登録!G5","v":0},{"$f":"商品一括登録!H5","v":0},{"$f":"商品一括登録!I5","v":0},{"$f":"商品一括登録!J5","v":0},{"$f":"商品一括登録!K5","v":0},{"$f":"商品一括登録!L5","v":0},0,{"$f":"#REF!","v":{"$error":"#REF!"}},{"$f":"#REF!","v":{"$error":"#REF!"}},{"$f":"#REF!","v":{"$error":"#REF!"}},{"$error":"#REF!"},null,null,null,null,null,null,"https://www.amazon.co.jp/dp/0","https://www.amazon.com/gp/offer-listing/0/ref=olp_f_new?ie=UTF8&f_new=true","https://www.amazon.com/s/ref=nb_sb_noss?url=search-alias%3Daps&field-keywords=0","http://www.ebay.com/sch/i.html?_from=R40&_sacat=0&LH_ItemCondition=3&_nkw=0&_sop=15",{"$f":"IF(U5=\"\",I5*#REF!,U5*#REF!)","v":{"$error":"#REF!"}},{"$f":"J5*#REF!","v":{"$error":"#REF!"}},{"$f":"((AC5/100)*#REF!)","v":{"$error":"#REF!"}},{"$f":"(#REF!*J5)+#REF!","v":{"$error":"#REF!"}},{"$error":"#REF!"},0,{"$error":"#REF!"},{"$error":"#REF!"},{"$f":"IF(AJ5>#REF!,\"o\",\"\")","v":{"$error":"#REF!"}},"",{"$f":"IF(商品一括登録!A5=#REF!,\"o\",\"x\")","v":{"$error":"#REF!"}},{"$f":"IF(IFERROR(VLOOKUP(B5,#REF!,1,FALSE),\"\")<>\"\",\"o\",\"\")","v":""}]
[4,{"$f":"TEXT(商品一括登録!A6,0)","v":"0"},{"$f":"TEXT(商品一括登録!B6,0)","v":"0"},{"$f":"商品一括登録!C6","v":0},{"$f":"商品一括登録!D6","v":0},{"$f":"商品一括登録!E6","v":0},{"$f":"商品一括登録!F6","v":0},{"$f":"商品一括登録!G6","v":0},{"$f":"商品一括登録!H6","v":0},{"$f":"商品一括登録!I6","v":0},{"$f":"商品一括登録!J6","v":0},{"$f":"商品一括登録!K6","v":0},{"$f":"商品一括登録!L6","v":0},0,{"$f":"#REF!","v":{"$error":"#REF!"}},{"$f":"#REF!","v":{"$error":"#REF!"}},{"$f":"#REF!","v":{"$error":"#REF!"}},{"$error":"#REF!"},null,null,null,null,null,null,"https://www.amazon.co.jp/dp/0","https://www.amazon.com/gp/offer-listing/0/ref=olp_f_new?ie=UTF8&f_new=true","https://www.amazon.com/s/ref=nb_sb_noss?url=search-alias%3Daps&field-keywords=0","http://www.ebay.com/sch/i.html?_from=R40&_sacat=0&LH_ItemCondition=3&_nkw=0&_sop=15",{"$f":"IF(U6=\"\",I6*#REF!,U6*#REF!)","v":{"$error":"#REF!"}},{"$f":"J6*#REF!","v":{"$error":"#REF!"}},{"$f":"((AC6/100)*#REF!)","v":{"$error":"#REF!"}},{"$f":"(#REF!*J6)+#REF!","v":{"$error":"#REF!"}},{"$error":"#REF!"},0,{"$error":"#REF!"},{"$error":"#REF!"},{"$f":"IF(AJ6>#REF!,\"o\",\"\")","v":{"$error":"#REF!"}},"",{"$f":"IF(商品一括登録!A6=#REF!,\"o\",\"x\")","v":{"$error":"#REF!"}},{"$f":"IF(IFERROR(VLOOKUP(B6,#REF!,1,FALSE),\"\")<>\"\",\"o\",\"\")","v":""}]
[5,{"$f":"TEXT(商品一括登録!A7,0)","v":"0"},{"$f":"TEXT(商品一括登録!B7,0)","v":"0"},{"$f":"商品一括登録!C7","v":0},{"$f":"商品一括登録!D7","v":0},{"$f":"商品一括登録!E7","v":0},{"$f":"商品一括登録!F7","v":0},{"$f":"商品一括登録!G7","v":0},{"$f":"商品一括登録!H7","v":0},{"$f":"商品一括登録!I7","v":0},{"$f":"商品一括登録!J7","v":0},{"$f":"商品一括登録!K7","v":0},{"$f":"商品一括登録!L7","v":0},0,{"$f":"#REF!","v":{"$error":"#REF!"}},{"$f":"#REF!","v":{"$error":"#REF!"}},{"$f":"#REF!","v":{"$error":"#REF!"}},{"$error":"#REF!"},null,null,null,null,null,null,"https://www.amazon.co.jp/dp/0","https://www.amazon.com/gp/offer-listing/0/ref=olp_f_new?ie=UTF8&f_new=true","https://www.amazon.com/s/ref=nb_sb_noss?url=search-alias%3Daps&field-keywords=0","http://www.ebay.com/sch/i.html?_from=R40&_sacat=0&LH_ItemCondition=3&_nkw=0&_sop=15",{"$f":"IF(U7=\"\",I7*#REF!,U7*#REF!)","v":{"$error":"#REF!"}},{"$f":"J7*#REF!","v":{"$error":"#REF!"}},{"$f":"((AC7/100)*#REF!)","v":{"$error":"#REF!"}},{"$f":"(#REF!*J7)+#REF!","v":{"$error":"#REF!"}},{"$error":"#REF!"},0,{"$error":"#REF!"},{"$error":"#REF!"},{"$f":"IF(AJ7>#REF!,\"o\",\"\")","v":{"$error":"#REF!"}},"",{"$f":"IF(商品一括登録!A7=#REF!,\"o\",\"x\")","v":{"$error":"#REF!"}},{"$f":"IF(IFERROR(VLOOKUP(B7,#REF!,1,FALSE),\"\")<>\"\",\"o\",\"\")","v":""}]
[6,{"$f":"TEXT(商品一括登録!A8,0)","v":"0"},{"$f":"TEXT(商品一括登録!B8,0)","v":"0"},{"$f":"商品一括登録!C8","v":0},{"$f":"商品一括登録!D8","v":0},{"$f":"商品一括登録!E8","v":0},{"$f":"商品一括登録!F8","v":0},{"$f":"商品一括登録!G8","v":0},{"$f":"商品一括登録!H8","v":0},{"$f":"商品一括登録!I8","v":0},{"$f":"商品一括登録!J8","v":0},{"$f":"商品一括登録!K8","v":0},{"$f":"商品一括登録!L8","v":0},0,{"$f":"#REF!","v":{"$error":"#REF!"}},{"$f":"#REF!","v":{"$error":"#REF!"}},{"$f":"#REF!","v":{"$error":"#REF!"}},{"$error":"#REF!"},null,null,null,null,null,null,"https://www.amazon.co.jp/dp/0","https://www.amazon.com/gp/offer-listing/0/ref=olp_f_new?ie=UTF8&f_new=true","https://www.amazon.com/s/ref=nb_sb_noss?url=search-alias%3Daps&field-keywords=0","http://www.ebay.com/sch/i.html?_from=R40&_sacat=0&LH_ItemCondition=3&_nkw=0&_sop=15",{"$f":"IF(U8=\"\",I8*#REF!,U8*#REF!)","v":{"$error":"#REF!"}},{"$f":"J8*#REF!","v":{"$error":"#REF!"}},{"$f":"((AC8/100)*#REF!)","v":{"$error":"#REF!"}},{"$f":"(#REF!*J8)+#REF!","v":{"$error":"#REF!"}},{"$error":"#REF!"},0,{"$error":"#REF!"},{"$error":"#REF!"},{"$f":"IF(AJ8>#REF!,\"o\",\"\")","v":{"$error":"#REF!"}},"",{"$f":"IF(商品一括登録!A8=#REF!,\"o\",\"x\")","v":{"$error":"#REF!"}},{"$f":"IF(IFERROR(VLOOKUP(B8,#REF!,1,FALSE),\"\")<>\"\",\"o\",\"\")","v":""}]
[7,{"$f":"TEXT(商品一括登録!A9,0)","v":"0"},{"$f":"TEXT(商品一括登録!B9,0)","v":"0"},{"$f":"商品一括登録!C9","v":0},{"$f":"商品一括登録!D9","v":0},{"$f":"商品一括登録!E9","v":0},{"$f":"商品一括登録!F9","v":0},{"$f":"商品一括登録!G9","v":0},{"$f":"商品一括登録!H9","v":0},{"$f":"商品一括登録!I9","v":0},{"$f":"商品一括登録!J9","v":0},{"$f":"商品一括登録!K9","v":0},{"$f":"商品一括登録!L9","v":0},0,{"$f":"#REF!","v":{"$error":"#REF!"}},{"$f":"#REF!","v":{"$error":"#REF!"}},{"$f":"#REF!","v":{"$error":"#REF!"}},{"$error":"#REF!"},null,null,null,null,null,null,"https://www.amazon.co.jp/dp/0","https://www.amazon.com/gp/offer-listing/0/ref=olp_f_new?ie=UTF8&f_new=true","https://www.amazon.com/s/ref=nb_sb_noss?url=search-alias%3Daps&field-keywords=0","http://www.ebay.com/sch/i.html?_from=R40&_sacat=0&LH_ItemCondition=3&_nkw=0&_sop=15",{"$f":"IF(U9=\"\",I9*#REF!,U9*#REF!)","v":{"$error":"#REF!"}},{"$f":"J9*#REF!","v":{"$error":"#REF!"}},{"$f":"((AC9/100)*#REF!)","v":{"$error":"#REF!"}},{"$f":"(#REF!*J9)+#REF!","v":{"$error":"#REF!"}},{"$error":"#REF!"},0,{"$error":"#REF!"},{"$error":"#REF!"},{"$f":"IF(AJ9>#REF!,\"o\",\"\")","v":{"$error":"#REF!"}},"",{"$f":"IF(商品一括登録!A9=#REF!,\"o\",\"x\")","v":{"$error":"#REF!"}},{"$f":"IF(IFERROR(VLOOKUP(B9,#REF!,1,FALSE),\"\")<>\"\",\"o\",\"\")","v":""}]
[8,{"$f":"TEXT(商品一括登録!A10,0)","v":"0"},{"$f":"TEXT(商品一括登録!B10,0)","v":"0"},{"$f":"商品一括登録!C10","v":0},{"$f":"商品一括登録!D10","v":0},{"$f":"商品一括登録!E10","v":0},{"$f":"商品一括登録!F10","v":0},{"$f":"商品一括登録!G10","v":0},{"$f":"商品一括登録!H10","v":0},{"$f":"商品一括登録!I10","v":0},{"$f":"商品一括登録!J10","v":0},{"$f":"商品一括登録!K10","v":0},{"$f":"商品一括登録!L10","v":0},0,{"$f":"#REF!","v":{"$error":"#REF!"}},{"$f":"#REF!","v":{"$error":"#REF!"}},{"$f":"#REF!","v":{"$error":"#REF!"}},{"$error":"#REF!"},null,null,null,null,null,null,"https://www.amazon.co.jp/dp/0","https://www.amazon.com/gp/offer-listing/0/ref=olp_f_new?ie=UTF8&f_new=true","https://www.amazon.com/s/ref=nb_sb_noss?url=search-alias%3Daps&field-keywords=0","http://www.ebay.com/sch/i.html?_from=R40&_sacat=0&LH_ItemCondition=3&_nkw=0&_sop=15",{"$f":"IF(U10=\"\",I10*#REF!,U10*#REF!)","v":{"$error":"#REF!"}},{"$f":"J10*#REF!","v":{"$error":"#REF!"}},{"$f":"((AC10/100)*#REF!)","v":{"$error":"#REF!"}},{"$f":"(#REF!*J10)+#REF!","v":{"$error":"#REF!"}},{"$error":"#REF!"},0,{"$error":"#REF!"},{"$error":"#REF!"},{"$f":"IF(AJ10>#REF!,\"o\",\"\")","v":{"$error":"#REF!"}},"",{"$f":"IF(商品一括登録!A10=#REF!,\"o\",\"x\")","v":{"$error":"#REF!"}},{"$f":"IF(IFERROR(VLOOKUP(B10,#REF!,1,FALSE),\"\")<>\"\",\"o\",\"\")","v":""}]
{"$rows_left_out":3}
{"sheet":"受注一覧","index":10,"n_rows":18,"n_cols":15,"rows_kept":18,"cut":false,"hidden":true,"merged":[]}
[]
[null,null,"　　　受注一覧"]
[]
[null,null,"対象期間",null,"～"]
[null,null,"状態"]
[null,null,"店舗",5,"その他店舗1"]
[null,null,"顧客"]
[null,null,"伝票No"]
[]
[]
{"$rows_left_out":9}
{"sheet":"受注登録","index":11,"n_rows":92,"n_cols":16,"rows_kept":92,"cut":false,"hidden":true,"merged":[[1,25,1,26],[1,28,1,29],[1,31,1,32]]}
[]
[null,null,"　　　受注登録"]
[]
[]
[]
[]
[]
[]
[null,"■登録情報"]
[null,null,"伝票No",2]
{"$rows_left_out":83}
{"sheet":"出荷登録","index":12,"n_rows":17,"n_cols":14,"rows_kept":17,"cut":false,"hidden":true,"merged":[]}
[]
[null,null,"　　　出荷登録"]
[]
[null,null,"対象期間","2017-7-1","～","2017-7-31"]
[null,null,"出荷状態"]
[null,null,"店舗"]
[null,null,"顧客名"]
[null,null,"伝票No"]
[]
[]
{"$rows_left_out":8}
{"sheet":"請求登録","index":13,"n_rows":17,"n_cols":37,"rows_kept":17,"cut":false,"hidden":true,"merged":[[1,28,1,29],[1,31,1,32],[1,34,1,35]]}
[]
[null,null,"　　　請求登録",null,null,null,null,null,null,null,null,null,null,null,null,null,null,null,null,null,null,null,null,null,null,null,null,null,null,null,"年",null,null,"月",null,null,"日"]
[]
[null,null,"対象期間","2017-7-1","～","2017-7-31"]
[null,null,"請求状態"]
[null,null,"店舗"]
[null,null,"顧客名"]
[null,null,"伝票No"]
[]
[]
{"$rows_left_out":8}
{"sheet":"入金登録","index":14,"n_rows":17,"n_cols":37,"rows_kept":17,"cut":false,"hidden":true,"merged":[[1,28,1,29],[1,31,1,32],[1,34,1,35]]}
[]
[null,null,"　　　入金登録",null,null,null,null,null,null,null,null,null,null,null,null,null,null,null,null,null,null,null,null,null,null,null,null,null,null,null,"年",null,null,"月",null,null,"日"]
[]
[null,null,"対象期間","2017-7-1","～","2017-7-31"]
[null,null,"入金状態"]
[null,null,"店舗"]
[null,null,"顧客名"]
[null,null,"伝票No"]
[]
[]
{"$rows_left_out":8}
{"sheet":"請求書","index":15,"n_rows":32,"n_cols":34,"rows_kept":32,"cut":false,"hidden":true,"merged":[[27,22,27,26],[27,27,27,33],[28,22,28,26],[28,27,28,33],[29,22,29,26],[29,27,29,33],[26,2,26,3],[26,4,26,12],[26,13,26,17],[26,18,26,21],[26,22,26,26],[26,27,26,33],[28,19,28,21],[25,2,25,3],[25,4,25,12],[25,13,25,17],[25,18,25,21],[25,22,25,26],[25,27,25,33],[24,2,24,3],[24,4,24,12],[24,13,24,17],[24,18,24,21],[24,22,24,26],[24,27,24,33],[23,2,23,3],[23,4,23,12],[23,13,23,17],[23,18,23,21],[23,22,23,26],[23,27,23,33],[22,2,22,3],[22,4,22,12],[22,13,22,17],[22,18,22,21],[22,22,22,26],[22,27,22,33],[21,2,21,3],[21,4,21,12],[21,13,21,17],[21,18,21,21],[21,22,21,26],[21,27,21,33],[20,2,20,3],[20,4,20,12],[20,13,20,17],[20,18,20,21],[20,22,20,26],[20,27,20,33],[19,2,19,3],[19,4,19,12],[19,13,19,17],[19,18,19,21],[19,22,19,26],[19,27,19,33],[18,2,18,3],[18,4,18,12],[18,13,18,17],[18,18,18,21],[18,22,18,26],[18,27,18,33],[17,2,17,3],[17,4,17,12],[17,13,17,17],[17,18,17,21],[17,22,17,26],[17,27,17,33],[16,2,16,3],[16,4,16,12],[16,13,16,17],[16,18,16,21],[16,22,16,26],[16,27,16,33],[15,2,15,3],[15,4,15,12],[15,13,15,17],[15,18,15,21],[15,22,15,26],[15,27,15,33],[14,2,14,3],[14,4,14,12],[14,13,14,17],[14,18,14,21],[14,22,14,26],[14,27,14,33],[13,2,13,3],[13,4,13,12],[13,13,13,17],[13,18,13,21],[13,22,13,26],[13,27,13,33],[12,2,12,3],[12,4,12,12],[12,13,12,17],[12,18,12,21],[12,22,12,26],[12,27,12,33],[11,2,11,3],[11,4,11,12],[11,13,11,17],[11,18,11,21],[11,22,11,26],[11,27,11,33],[10,2,10,3],[10,4,10,12],[10,13,10,17],[10,18,10,21],[10,22,10,26],[10,27,10,33],[5,2,5,18],[5,21,5,33],[6,2,6,18],[6,24,6,33],[7,24,7,33],[8,24,8,33],[1,25,1,26],[1,28,1,29],[1,31,1,32],[3,2,3,18],[3,21,3,33],[4,2,4,18],[4,22,4,33]]}
[]
[null,null,null,"請求書",null,null,null,null,null,null,null,null,null,null,null,null,null,null,null,null,null,null,null,null,null,null,null,"年",null,null,"月",null,null,"日"]
[]
[null,null,null,null,null,null,null,null,null,null,null,null,null,null,null,null,null,null,null,null,null,{"$f":"システムマスタ!D9","v":"有限会社ポートフォリオ"}]
[null,null,null,null,null,null,null,null,null,null,null,null,null,null,null,null,null,null,null,null,null,"〒",{"$f":"システムマスタ!L9","v":"193-0033"}]
[null,null,null,null,null,null,null,null,null,null,null,null,null,null,null,null,null,null,null,null,null,{"$f":"システムマスタ!L10","v":"東京都八王子市旭町4-11-9"}]
[null,null,"【担当者名を記載】",null,null,null,null,null,null,null,null,null,null,null,null,null,null,null,null,null,null,"担当",null,"：",{"$f":"システムマスタ!D19","v":"名前："}]
[null,null,null,null,null,null,null,null,null,null,null,null,null,null,null,null,null,null,null,null,null,"TEL",null,"：",{"$f":"システムマスタ!L13","v":"042-665-1234"}]
[null,null,null,null,null,null,null,null,null,null,null,null,null,null,null,null,null,null,null,null,null,"FAX",null,"：",{"$f":"システムマスタ!L16","v":"042-665-1235"}]
[]
{"$rows_left_out":23}
{"sheet":"システムマスタ","index":16,"n_rows":34,"n_cols":16,"rows_kept":34,"cut":false,"hidden":true,"merged":[[19,4,19,7],[22,4,22,7],[23,4,23,7],[22,11,22,15],[18,11,18,15],[23,11,23,15],[19,11,19,15],[8,3,8,7],[9,11,9,15],[18,4,18,7],[12,11,12,12],[15,11,15,12],[12,3,12,7],[15,3,15,7]]}
[]
[null,null,"　　システムマスタ"]
[]
[]
[]
[]
[]
[null,"■会社名",null,null,null,null,null,null,null,"■会社住所"]
[null,null,null,"有限会社ポートフォリオ",null,null,null,null,null,null,null,"193-0033"]
[null,null,"カナ","ﾕｳｹﾞﾝｶﾞｲｼｬﾎﾟｰﾄﾌｫﾘｵ",null,null,null,null,null,null,null,"東京都八王子市旭町4-11-9"]
{"$rows_left_out":25}
{"sheet":"帳票設定","index":17,"n_rows":20,"n_cols":7,"rows_kept":20,"cut":false,"hidden":true,"merged":[]}
[]
[null,null,"　　帳票設定"]
[]
[]
[]
[]
[]
[null,null,null,"帳票","項目","行","列"]
[null,null,null,"請求書","請求年",2,26]
[null,null,null,"請求書","請求月",2,29]
{"$rows_left_out":11}
{"sheet":"ルールシート","index":18,"n_rows":12,"n_cols":13,"rows_kept":12,"cut":false,"hidden":true,"merged":[]}
["列1","No.","項目名称","文字形式","桁数","宅急便\n必須項目","DM便\n必須項目","正規表現","シート名","列番号","元の値","変換後の値","備考"]
["ご依頼主データ",1,"ご依頼主コード","半角英数字","20文字",null,null,"^[a-zA-Z\\d]{0,12}$","インプット",1,null,{"$f":"テーブル143[[#This Row],[元の値]]","v":0}]
["ご依頼主データ",2,"ご依頼主電話番号","半角英数字&ハイフン","15文字","○",null,"^[a-zA-Z\\d-]{0,15}$","インプット",5,null,{"$f":"テーブル143[[#This Row],[元の値]]","v":0},"ハイフン含む"]
["ご依頼主データ",3,"ご依頼主電話番号枝番","半角英数字","2文字",null,null,null,"インプット","-",null,"0","「0」固定"]
["ご依頼主データ",4,"ご依頼主郵便番号","半角英数字&ハイフン","8文字","○",null,"^[a-zA-Z\\d-]{7,8}$","インプット",7,null,{"$f":"テーブル143[[#This Row],[元の値]]","v":0},"ハイフンなし半角7文字も可"]
["ご依頼主データ",5,"ご依頼主住所","全角/半角\n都道府県（４文字）\n＋市区郡町村（１２文字）\n＋町・番地（１６文字）","32文字/64文字","○",null,"^.{0,64}$","インプット",8,null,{"$f":"テーブル143[[#This Row],[元の値]]","v":0}]
["ご依頼主データ",6,"ご依頼主住所（アパートマンション名）","全角/半角 ","16文字/32文字",null,null,null,"インプット","-",null,null,"空白固定"]
["ご依頼主データ",7,"ご依頼主名","全角/半角 ","16文字/32文字","○",null,"^.{0,32}$","インプット",2,null,{"$f":"テーブル143[[#This Row],[元の値]]","v":0}]
["ご依頼主データ",8,"ご依頼主名略称カナ","半角カタカナ","50文字",null,null,"^[ｦ-ﾟ]{0,50}$","インプット",3,null,{"$f":"テーブル143[[#This Row],[元の値]]","v":0}]
["ご依頼主データ",9,"ご請求先顧客コード","半角数字 ","12文字",null,null,null,"インプット",1,null,{"$f":"テーブル143[[#This Row],[元の値]]","v":0}]
{"$rows_left_out":3}
{"sheet":"ゆうパック宛名エクスポート","index":19,"n_rows":127,"n_cols":14,"rows_kept":127,"cut":false,"hidden":true,"merged":[]}
["データ種類","No.","項目名","文字形式","桁数","必須","正規表現","シート名","列番号","元の値","返還後の値","説明"]
["アドレス帳(標準フォーマット)",1,"利用区分","数値",1,"○",null,null,null,null,1,"ご依頼主の場合は「0」、お届け先の場合は「1」を必ず設定してください。"]
["アドレス帳(標準フォーマット)",2,"お名前","全角文字",25,"※1",null,null,null,null,{"$f":"テーブル20[[#This Row],[元の値]]","v":0},null,null,"※1　お名前、法人名のどちらか一方は必ず設定してください。"]
["アドレス帳(標準フォーマット)",3,"お名前（カナ）","全角カナ",25,"-",null,null,null,null,{"$f":"テーブル20[[#This Row],[元の値]]","v":0}]
["アドレス帳(標準フォーマット)",4,"法人名","全角文字",25,"※1",null,null,null,null,{"$f":"テーブル20[[#This Row],[元の値]]","v":0},"法人名と部署名は合計で30文字以下になるように設定してください。",null,"※1　お名前、法人名のどちらか一方は必ず設定してください。"]
["アドレス帳(標準フォーマット)",5,"部署名","全角文字",25,"-",null,null,null,null,{"$f":"テーブル20[[#This Row],[元の値]]","v":0},"法人名と部署名は合計で30文字以下になるように設定してください。"]
["アドレス帳(標準フォーマット)",6,"敬称","全角文字",2,"-",null,null,null,null,{"$f":"テーブル20[[#This Row],[元の値]]","v":0},"「様」「殿」「御中」「行」「係」「宛」のいずれかを設定してください。\n（何も設定しない場合は敬称を付加しません）"]
["アドレス帳(標準フォーマット)",7,"郵便番号","半角数字",7,"○",null,null,null,null,{"$f":"テーブル20[[#This Row],[元の値]]","v":0}]
["アドレス帳(標準フォーマット)",8,"都道府県","全角文字",4,"-",null,null,null,null,{"$f":"テーブル20[[#This Row],[元の値]]","v":0}]
["アドレス帳(標準フォーマット)",9,"市区町村郡","全角文字",25,"○",null,null,null,null,{"$f":"テーブル20[[#This Row],[元の値]]","v":0},"都道府県と市区町村郡は合計で25文字以下になるように設定してください。"]
{"$rows_left_out":118}
{"sheet":"ヤマトB2エクスポート","index":20,"n_rows":305,"n_cols":8,"rows_kept":305,"cut":false,"hidden":true,"merged":[]}
["列1","No.","項目名称","文字形式","最大入出力文字数","宅急便\n必須項目","DM便\n必須項目","備考"]
["送り状発行データ",1,"お客様管理番号","半角英数字","50文字"]
[null,2,"送り状種別","半角数字","1文字","○","○","0 : 発払\n2 : コレクト\n3 : DM便\n4 : タイム\n5 : 着払\n7 : ネコポス\n 8 : 宅急便コンパクト\n 9 : 宅急便コンパクトコレクト"]
[null,3,"クール区分","半角数字＆空白","1文字","（○）",null,"0または空白 : 通常\n1 : クール冷凍\n2 : クール冷蔵\n※発払・コレクト・着払のみ指定可能"]
[null,4,"伝票番号","半角数字","12文字",null,null,"データ入力用は空白を指定"]
[null,null,null,null,null,null,null,"（データ出力用の項目として使用）"]
[]
[null,null,null,null,null,null,null,"※ただし、データ入力時に使用する場合有り"]
[null,null,null,null,null,null,null,"（伝票番号を指定して取込む場合のみ）"]
[null,5,"出荷予定日","半角数字","10文字","○","○","YYYY/MM/DD形式"]
{"$rows_left_out":296}
{"sheet":"発注一覧","index":21,"n_rows":23,"n_cols":18,"rows_kept":23,"cut":false,"hidden":true,"merged":[]}
[]
[null,null,"　　　発注一覧"]
[]
[null,null,"対象期間",null,"～"]
[null,null,"状態"]
[null,null,"店舗"]
[null,null,"顧客名"]
[null,null,"伝票No"]
[]
[]
{"$rows_left_out":14}
{"sheet":"発注登録","index":22,"n_rows":24,"n_cols":5,"rows_kept":24,"cut":false,"hidden":true,"merged":[[1,25,1,26],[1,28,1,29],[1,31,1,32]]}
[]
[null,null,"　　　仕入登録"]
[]
[]
[]
[]
[]
[]
[null,"■登録情報"]
[null,null,"伝票No"]
{"$rows_left_out":15}
{"sheet":"検品登録","index":23,"n_rows":23,"n_cols":18,"rows_kept":23,"cut":false,"hidden":true,"merged":[]}
[]
[null,null,"　　　検品登録"]
[]
[null,null,"対象期間",null,"～"]
[null,null,"状態"]
[null,null,"店舗"]
[null,null,"顧客名"]
[null,null,"伝票No"]
[]
[]
{"$rows_left_out":14}
{"sheet":"支払登録","index":24,"n_rows":23,"n_cols":18,"rows_kept":23,"cut":false,"hidden":true,"merged":[]}
[]
[null,null,"　　　支払登録"]
[]
[null,null,"対象期間",null,"～"]
[null,null,"状態"]
[null,null,"店舗"]
[null,null,"顧客名"]
[null,null,"伝票No"]
[]
[]
{"$rows_left_out":13}